Patchwork fstests: update to git master

login
register
mail settings
Submitter Ross Burton
Date Dec. 5, 2013, 4:18 p.m.
Message ID <1386260327-27927-1-git-send-email-ross.burton@intel.com>
Download mbox | patch
Permalink /patch/62919/
State New
Headers show

Comments

Patch

diff --git a/meta/recipes-graphics/fstests/files/dso_linking_change_build_fix.patch b/meta/recipes-graphics/fstests/files/dso_linking_change_build_fix.patch
deleted file mode 100644
index 37a1f32..0000000
--- a/meta/recipes-graphics/fstests/files/dso_linking_change_build_fix.patch
+++ /dev/null
@@ -1,74 +0,0 @@ 
-Upstream-Status: Pending
-
-after gcc linking has changed, all the libraries must be explicitely specified 
-This patch avoids these linking errors:
-
-
-| make[1]: Entering directory `/disk0/pokybuild/build1/tmp/work/i586-poky-linux/fstests-0.0+svnr426-r0/fstests/tests'^M
-| ccache i586-poky-linux-gcc -march=i586 --sysroot=/disk0/pokybuild/build1/tmp/sysroots/i586-poky-linux -pthread -I/disk0/pokybuild/build1/tmp/sysroots/i586-poky-linux/usr/include/gtk-2.0 -I/disk0/pokybuild/build1/tmp/sysroots/i586-poky-linux/usr/lib/gtk-2.0/include -I/disk0/pokybuild/build1/tmp/sysroots/i586-poky-linux/usr/include/atk-1.0 -I/disk0/pokybuild/build1/tmp/sysroots/i586-poky-linux/usr/include/cairo -I/disk0/pokybuild/build1/tmp/sysroots/i586-poky-linux/usr/include/pango-1.0 -I/disk0/pokybuild/build1/tmp/sysroots/i586-poky-linux/usr/include/glib-2.0 -I/disk0/pokybuild/build1/tmp/sysroots/i586-poky-linux/usr/lib/glib-2.0/include -I/disk0/pokybuild/build1/tmp/sysroots/i586-poky-linux/usr/include/pixman-1 -I/disk0/pokybuild/build1/tmp/sysroots/i586-poky-linux/usr/include/freetype2 -I/disk0/pokybuild/build1/tmp/sysroots/i586-poky-linux/usr/include/libpng12   -pthread -I/disk0/pokybuild/build1/tmp/sysroots/i586-poky-linux/usr/include/pango-1.0 -I/disk0/pokybuild/build1/tmp/sysroots/i586-poky-linux/usr/include/glib-2.0 -I/disk0/pokybuild/build1/tmp/sysroots/i586-poky-linux/usr/lib/glib-2.0/include -I/disk0/pokybuild/build1/tmp/sysroots/i586-poky-linux/usr/include/freetype2   -fexpensive-optimizations -fomit-frame-pointer -frename-registers -O2 -ggdb -feliminate-unused-debug-types  -Wl,-O1 -Wl,--hash-style=gnu -Wl,--as-needed -o test-gtk-layout test_gtk_layout-test-gtk-layout.o -pthread -lgtk-x11-2.0 -lgdk-x11-2.0 -latk-1.0 -lgio-2.0 -lpangoft2-1.0 -lgdk_pixbuf-2.0 -lpangocairo-1.0 -lcairo -lpango-1.0 -lfreetype -lfontconfig -lgobject-2.0 -lgmodule-2.0 -lgthread-2.0 -lrt -lglib-2.0   -pthread -lpangoxft-1.0 -lpangoft2-1.0 -lXft -lpango-1.0 -lfreetype -lfontconfig -lgobject-2.0 -lgmodule-2.0 -lgthread-2.0 -lrt -lglib-2.0^M
-| /disk0/pokybuild/build1/tmp/sysroots/x86_64-linux/usr/libexec/i586-poky-linux/gcc/i586-poky-linux/4.5.1/ld: t^A: invalid DSO for symbol `XSync' definition^M
-| /disk0/pokybuild/build1/tmp/sysroots/i586-poky-linux/usr/lib/libX11.so.6: could not read symbols: Bad value^M
-| collect2: ld returned 1 exit status^M
-| make[1]: *** [test-gtk-layout] Error 1
-
-
-|ccache i586-poky-linux-gcc -march=i586 --sysroot=/disk0/pokybuild/build1/tmp/sysroots/i586-poky-linux -pthread -I/disk0/pokybuild/build1/tmp/sysroots/i586-poky-linux/usr/include/pango-1.0 -I/disk0/pokybuild/build1/tmp/sysroots/i586-poky-linux/usr/include/glib-2.0 -I/disk0/pokybuild/build1/tmp/sysroots/i586-poky-linux/usr/lib/glib-2.0/include -I/disk0/pokybuild/build1/tmp/sysroots/i586-poky-linux/usr/include/freetype2   -fexpensive-optimizations -fomit-frame-pointer -frename-registers -O2 -ggdb -feliminate-unused-debug-types  -Wl,-O1 -Wl,--hash-style=gnu -Wl,--as-needed -o test-pango test_pango-test-pango.o -pthread -lpangoxft-1.0 -lpangoft2-1.0 -lXft -lpango-1.0 -lfreetype -lfontconfig -lgobject-2.0 -lgmodule-2.0 -lgthread-2.0 -lrt -lglib-2.0
-| /disk0/pokybuild/build1/tmp/sysroots/x86_64-linux/usr/libexec/i586-poky-linux/gcc/i586-poky-linux/4.5.1/ld: ?: invalid DSO for symbol `XOpenDisplay' definition
-| /disk0/pokybuild/build1/tmp/sysroots/i586-poky-linux/usr/lib/libX11.so.6: could not read symbols: Bad value
-| collect2: ld returned 1 exit status
-| make[1]: *** [test-pango] Error 1
-
-
-| ccache i586-poky-linux-gcc -march=i586 --sysroot=/disk0/pokybuild/build1/tmp/sysroots/i586-poky-linux -pthread -I/disk0/pokybuild/build1/tmp/sysroots/i586-poky-linux/usr/include/gtk-2.0 -I/disk0/pokybuild/build1/tmp/sysroots/i586-poky-linux/usr/lib/gtk-2.0/include -I/disk0/pokybuild/build1/tmp/sysroots/i586-poky-linux/usr/include/atk-1.0 -I/disk0/pokybuild/build1/tmp/sysroots/i586-poky-linux/usr/include/cairo -I/disk0/pokybuild/build1/tmp/sysroots/i586-poky-linux/usr/include/pango-1.0 -I/disk0/pokybuild/build1/tmp/sysroots/i586-poky-linux/usr/include/glib-2.0 -I/disk0/pokybuild/build1/tmp/sysroots/i586-poky-linux/usr/lib/glib-2.0/include -I/disk0/pokybuild/build1/tmp/sysroots/i586-poky-linux/usr/include/pixman-1 -I/disk0/pokybuild/build1/tmp/sysroots/i586-poky-linux/usr/include/freetype2 -I/disk0/pokybuild/build1/tmp/sysroots/i586-poky-linux/usr/include/libpng12   -pthread -I/disk0/pokybuild/build1/tmp/sysroots/i586-poky-linux/usr/include/pango-1.0 -I/disk0/pokybuild/build1/tmp/sysroots/i586-poky-linux/usr/include/glib-2.0 -I/disk0/pokybuild/build1/tmp/sysroots/i586-poky-linux/usr/lib/glib-2.0/include -I/disk0/pokybuild/build1/tmp/sysroots/i586-poky-linux/usr/include/freetype2   -fexpensive-optimizations -fomit-frame-pointer -frename-registers -O2 -ggdb -feliminate-unused-debug-types  -Wl,-O1 -Wl,--hash-style=gnu -Wl,--as-needed -o test-pango-gdk test_pango_gdk-test-pango-gdk.o -pthread -lgtk-x11-2.0 -lgdk-x11-2.0 -latk-1.0 -lgio-2.0 -lpangoft2-1.0 -lgdk_pixbuf-2.0 -lpangocairo-1.0 -lcairo -lpango-1.0 -lfreetype -lfontconfig -lgobject-2.0 -lgmodule-2.0 -lgthread-2.0 -lrt -lglib-2.0   -pthread -lpangoxft-1.0 -lpangoft2-1.0 -lXft -lpango-1.0 -lfreetype -lfontconfig -lgobject-2.0 -lgmodule-2.0 -lgthread-2.0 -lrt -lglib-2.0
-| /disk0/pokybuild/build1/tmp/sysroots/x86_64-linux/usr/libexec/i586-poky-linux/gcc/i586-poky-linux/4.5.1/ld: t: invalid DSO for symbol `XSync' definition
-| /disk0/pokybuild/build1/tmp/sysroots/i586-poky-linux/usr/lib/libX11.so.6: could not read symbols: Bad value
-| collect2: ld returned 1 exit status
-| make[1]: *** [test-pango-gdk] Error 1
-
-
-| ccache i586-poky-linux-gcc -march=i586 --sysroot=/disk0/pokybuild/build1/tmp/sysroots/i586-poky-linux -pthread -I/disk0/pokybuild/build1/tmp/sysroots/i586-poky-linux/usr/include/gtk-2.0 -I/disk0/pokybuild/build1/tmp/sysroots/i586-poky-linux/usr/lib/gtk-2.0/include -I/disk0/pokybuild/build1/tmp/sysroots/i586-poky-linux/usr/include/atk-1.0 -I/disk0/pokybuild/build1/tmp/sysroots/i586-poky-linux/usr/include/cairo -I/disk0/pokybuild/build1/tmp/sysroots/i586-poky-linux/usr/include/pango-1.0 -I/disk0/pokybuild/build1/tmp/sysroots/i586-poky-linux/usr/include/glib-2.0 -I/disk0/pokybuild/build1/tmp/sysroots/i586-poky-linux/usr/lib/glib-2.0/include -I/disk0/pokybuild/build1/tmp/sysroots/i586-poky-linux/usr/include/pixman-1 -I/disk0/pokybuild/build1/tmp/sysroots/i586-poky-linux/usr/include/freetype2 -I/disk0/pokybuild/build1/tmp/sysroots/i586-poky-linux/usr/include/libpng12   -pthread -I/disk0/pokybuild/build1/tmp/sysroots/i586-poky-linux/usr/include/pango-1.0 -I/disk0/pokybuild/build1/tmp/sysroots/i586-poky-linux/usr/include/glib-2.0 -I/disk0/pokybuild/build1/tmp/sysroots/i586-poky-linux/usr/lib/glib-2.0/include -I/disk0/pokybuild/build1/tmp/sysroots/i586-poky-linux/usr/include/freetype2   -fexpensive-optimizations -fomit-frame-pointer -frename-registers -O2 -ggdb -feliminate-unused-debug-types  -Wl,-O1 -Wl,--hash-style=gnu -Wl,--as-needed -o test-pango-gtk test_pango_gtk-test-pango-gtk.o -pthread -lgtk-x11-2.0 -lgdk-x11-2.0 -latk-1.0 -lgio-2.0 -lpangoft2-1.0 -lgdk_pixbuf-2.0 -lpangocairo-1.0 -lcairo -lpango-1.0 -lfreetype -lfontconfig -lgobject-2.0 -lgmodule-2.0 -lgthread-2.0 -lrt -lglib-2.0   -pthread -lpangoxft-1.0 -lpangoft2-1.0 -lXft -lpango-1.0 -lfreetype -lfontconfig -lgobject-2.0 -lgmodule-2.0 -lgthread-2.0 -lrt -lglib-2.0
-| /disk0/pokybuild/build1/tmp/sysroots/x86_64-linux/usr/libexec/i586-poky-linux/gcc/i586-poky-linux/4.5.1/ld: t: invalid DSO for symbol `XSync' definition
-| /disk0/pokybuild/build1/tmp/sysroots/i586-poky-linux/usr/lib/libX11.so.6: could not read symbols: Bad value
-| collect2: ld returned 1 exit status
-| make[1]: *** [test-pango-gtk] Error 1
-
-
-Nitin A Kamble <nitin.a.kamble@intel.com>
-Date: 2011/01/11
-
-Index: tests/Makefile.am
-===================================================================
---- tests.orig/Makefile.am
-+++ tests/Makefile.am
-@@ -48,19 +48,19 @@ test_xft_CFLAGS = @XLIBS_CFLAGS@ @PANGO_
- 
- # draws pango strings with just x
- test_pango_SOURCES = test-pango.c
--test_pango_LDADD = @PANGO_LIBS@
-+test_pango_LDADD = @PANGO_LIBS@ @XLIBS_LIBS@
- test_pango_CFLAGS = @PANGO_CFLAGS@
- 
- #below are as above but on 
- 
- # Draws a list of Pango glyphs onto a GtkWindow with pango_xft_render
- test_pango_gdk_SOURCES = test-pango-gdk.c
--test_pango_gdk_LDADD = @GTK_LIBS@ @PANGO_LIBS@
-+test_pango_gdk_LDADD = @GTK_LIBS@ @PANGO_LIBS@ @XLIBS_LIBS@
- test_pango_gdk_CFLAGS = @GTK_CFLAGS@ @PANGO_CFLAGS@
- 
- # Draws a list of Pango glyphs onto a GtkDrawingArea with pango_xft_render
- test_pango_gtk_SOURCES = test-pango-gtk.c
--test_pango_gtk_LDADD = @GTK_LIBS@ @PANGO_LIBS@
-+test_pango_gtk_LDADD = @GTK_LIBS@ @PANGO_LIBS@ @XLIBS_LIBS@
- test_pango_gtk_CFLAGS = @GTK_CFLAGS@ @PANGO_CFLAGS@
- 
- # Draws a list of Pango glyphs onto a GtkWindow with gdk_draw_glyphs
-@@ -76,7 +76,7 @@ test_pango_layout_CFLAGS = @GTK_CFLAGS@ 
- 
- # As above PangoLayout onto a GtkWindow with gdk_draw_layout XXX TOGO ?
- test_gtk_layout_SOURCES = test-gtk-layout.c
--test_gtk_layout_LDADD = @GTK_LIBS@ @PANGO_LIBS@
-+test_gtk_layout_LDADD = @GTK_LIBS@ @PANGO_LIBS@ @XLIBS_LIBS@
- test_gtk_layout_CFLAGS = @GTK_CFLAGS@ @PANGO_CFLAGS@
- 
- 
diff --git a/meta/recipes-graphics/fstests/fstests_git.bb b/meta/recipes-graphics/fstests/fstests_git.bb
index 3d271ad..678d1e7 100644
--- a/meta/recipes-graphics/fstests/fstests_git.bb
+++ b/meta/recipes-graphics/fstests/fstests_git.bb
@@ -4,21 +4,13 @@  SECTION = "devel"
 LICENSE = "Zlib"
 DEPENDS = "pango libxext libxft virtual/libx11 gtk+"
 
-SRCREV = "218b99d82b56011e3f1b909e6baf22ce25af6334"
+SRCREV = "e5939ff608b95cdd4d0ab0e1935781ab9a276ac0"
 PV = "0.1+git${SRCPV}"
 
+SRC_URI = "git://git.yoctoproject.org/${BPN}"
 
-SRC_URI = "git://git.yoctoproject.org/${BPN} \
-           file://dso_linking_change_build_fix.patch"
+LIC_FILES_CHKSUM = "file://test-pango-gdk.c;endline=24;md5=1ee74ec851ecda57eb7ac6cc180f7655"
 
 S = "${WORKDIR}/git/tests"
 
 inherit autotools
-
-do_install() {
-    install -d ${D}${bindir}
-    find . -name "test-*" -type f -perm -755 -exec install -m 0755 {} ${D}${bindir} \;   
-}
-
-
-LIC_FILES_CHKSUM = "file://test-pango-gdk.c;endline=24;md5=1ee74ec851ecda57eb7ac6cc180f7655"